Home > Error Executing > Error Executing Script Runapp Null

Error Executing Script Runapp Null

Contents

My adviser wants to use my code for a spin-off, but I want to use it for my own company Problems with "+" in grep Asking client for discount on tickets Go the root folder of your project and run ‘grails clean' & ‘grails compile' Copyright©2014-2016JavaBrahman.com,allrightsreserved. under Eclipse Plugins Follow JavaBrahman on Google+Follow @javabrahman All original content on these pages is fingerprinted and certified by Digiprove Sign-Up for JavaBrahmanWeekly! Use --verbose to see entire trace.) java.lang.NoClassDefFoundError: _GrailsClasspath_groovy$_run_closure1 at _GrailsClasspath_groovy.run(_GrailsClasspath_groovy:39) at _GrailsClasspath_groovy$run.call(Unknown Source) at _GrailsEvents_groovy$run.call(Unknown Source) at org.codehaus.gant.IncludeTargets.leftShift(IncludeTargets.groovy:59) at org.codehaus.gant.IncludeTargets$leftShift.call(Unknown Source) at _GrailsEvents_groovy.run(_GrailsEvents_groovy:32) at _GrailsEvents_groovy$run.call(Unknown Source) at _GrailsClean_groovy$run.call(Unknown Source) at org.codehaus.gant.IncludeTargets.leftShift(IncludeTargets.groovy:59) click site

which version of groovy you are using ? –com.status.live Oct 14 '13 at 11:46 add a comment| 5 Answers 5 active oldest votes up vote 13 down vote accepted Delete target A positive integer gets reduced by 9 times when one of its digits is deleted.... Does Detect Magic allow you to recognize the shape of a magic item? Use --verbose to see entire trace.) org.codehaus.groovy.control.MultipleCompilationErrorsException: startup failed: __RunApp: 1: unexpected char: 0x0 @ line 1, column 1. 1 error at gant.Gant.compileScript(Gant.groovy:631) at gant.Gant.this$2$compileScript(Gant.groovy) at org.springsource.loaded.ri.ReflectiveInterceptor.jlrMethodInvoke(ReflectiveInterceptor.java:1259) at gant.Gant$_closure1.doCall(Gant.groovy:129) at org.springsource.loaded.ri.ReflectiveInterceptor.jlrMethodInvoke(ReflectiveInterceptor.java:1259)

Error Executing Script Runapp Null

Is R's glm function useless in a big data setting? Does the stacktrace list anything plugin related? Inverse permutation index Placed on work schedule despite approved time-off request.

balexander123 commented Jul 8, 2013 There's nothing related to plugins, and no grails.plugin.cucumber.CucumberTestType The stack trace seems to be groovy stack trace related. more hot questions question feed default about us tour help blog chat data legal privacy policy work here advertising info mobile contact us feedback Technology Life / Arts Culture / Recreation I also tried clean after stopping application but it does not help spring grails groovy share|improve this question asked May 10 '14 at 15:57 Nikhil 521722 add a comment| 2 Answers Creating monthly files from an annual file I have quarters and nickels, but not any dough more hot questions question feed default about us tour help blog chat data legal privacy

more stack exchange communities company blog Stack Exchange Inbox Reputation and Badges sign up log in tour help Tour Start here for a quick overview of the site Help Center Detailed Is masking before unsigned left shift in C/C++ too paranoid? Related 1Grails clean doesn't work0Grails install-plugin git Error5Grails 2.3 - run-app not working1Grails 2.3.0.M1 - upgrade not working7How to integrate angular js into grails 2.3.4?6Unique random token generation in grails0Date picker More hints Following these steps resolved it for me: Delete \ggts-3.4.0.RELEASE\.metadata\.plugins\org.grails.ide.eclipse.core\2.3.1\.slcache Run clean Run run-app share|improve this answer answered Oct 28 '13 at 20:40 jstricker 1,33911234 add a comment| up vote 1 down

I don't have this problem for a long time, but I don't know if it is a result of switching to grails 2.3 or not using auto reloading any more. –akn delete .grails/.slcache folder (is in your /home). In my case, I have fixed this issue by deleting the working directory as well as all the scripts in %HOMEPATH%/.grails/2.3.4/projects/projectName/scriptCache where "2.3.4" is Grails version and projectName denotes the Grails On Sun, Jul 7, 2013 at 9:35 PM, Barry Alexander wrote: … There's nothing related to plugins, and no grails.plugin.cucumber.CucumberTestType The stack trace seems to be groovy stack trace related.

  • Error executing script RunApp: null Date Index Thread: Prev Next Thread Index Hi All: I am using grails 0.4.2 under Windows XP,when run-app,got error below,any help would be appreciated.
  • Browse other questions tagged grails or ask your own question.
  • What should I do?

Privacy Policy Contact Us Home Page Free E-Book!! Welcome to Grails 0.4.2 - http://grails.org/Licensed under Apache Standard License 2.0 Grails home is set to: E:\groovy\grails-0.4.2 Base Directory: E:\MyEclipseWorkspace\edu Environment set to Error Executing Script Runapp Null Search for: Error Handling How to Solve - Error executing script RunApp: _GrailsClasspath_groovy$_run_closure1 May 26, 2015 JavaBrahman Leave a comment Error executing script RunApp: _GrailsClasspath_groovy$_run_closure1 (Use -stacktrace to see the full How to solve the old 'gun on a spaceship' problem?

We recommend upgrading to the latest Safari, Google Chrome, or Firefox. get redirected here share|improve this answer answered Feb 4 '14 at 10:41 danielad 3,23122248 add a comment| Your Answer draft saved draft discarded Sign up or log in Sign up using Google Sign Thanks Some useful information: Grails Version is 2.2.4 GRAILS_HOME=c:\grails GROOVY_HOME=C:\Program Files\Groovy JAVA_HOME=c:\Program Files\Java\jdk1.7.0_07 PATH=%JAVA_HOME%\bin;c:\OpenSSL\bin;%GRAILS_HOME%\bin;%GROOVY_HOME%\bin add: C:\grails\xxx>grails run-app --stacktrace | Configuring classpath | Error Error executing script RunApp: startup failed: __RunApp: 1: The more I think about this, I wonder if actually we should turn this into a generic AOP advice style approach that can work on any artefact classes, instead of just

However I am still getting the error message. the problem appears after generating several controllers, (i have 60 domains). an AOPAdviceBuilder. navigate to this website Loading Grails 2.2.2 | Configuring classpath. | Environment set to test..... | Packaging Grails application..... | Tests FAILED - view reports in /Users/barryalexander/Documents/workspace-ggts/Books/target/test-reports | Error java.lang.NullPointerException | Error at sun.reflect.NativeConstructorAccessorImpl.newInstance0(Native Method)

Can Homeowners insurance be cancelled for non-removal of tree debris? Combination of liquid hydrogen and liquid oxygen My adviser wants to use my code for a spin-off, but I want to use it for my own company How does the spell Are backpack nets an effective deterrent when going to rougher parts of the world?

Creating it I get another error: | Error Error executing script TestApp: cucumber.runtime.CucumberException: No features found at [test/cucumber] (NOTE: Stack trace has been filtered.

Wrong password - number of retries - what's a good number to allow? Join them; it only takes a minute: Sign up Grails: Error executing script Compile: startup failed: up vote 0 down vote favorite I've installed Grails on my Windows XP, but when Is there actually a cave entrance on every screen? Hi All: I am using grails 0.4.2 under Windows XP,when run-app,got error below,any help would be appreciated.

The fix is - 1. share|improve this answer edited Oct 15 '13 at 8:24 answered Oct 14 '13 at 21:33 akn 2,3071129 thanks for this - I had the same issue and this worked How to solve it? http://invictanetworks.net/error-executing/error-executing-script-runapp-java-io-filenotfoundexception.html The need for the Gram–Schmidt process Polyline split at node in QGIS Could clouds on aircraft wings produce lightning?

Free forum by Nabble Edit this page Grails › Grails Dev (Old Archive) Search everywhere only in this topic Advanced Search Error executing script RunApp: null ? ‹ Previous Topic Next Making my building blocks modular What would it take to make thorium a prominent energy source? I had problems until I did that. Is masking before unsigned left shift in C/C++ too paranoid?

I had to delete the ~/.grails/$version/projects/$projectName/scriptCache directory files. Someone gave me that solution and it worked. Does the stacktrace list anything plugin related? Thanks graemer, I'm running under DOS window, not eclipse.

Welcome to Grails 0.4.2 - http://grails.org/ Licensed under Apache Standard License 2.0 Grails home is set to: E:\groovy\grails-0.4.2 Base Directory: E:\MyEclipseWorkspace\edu Environment set to development Running script E:\groovy\grails-0.4.2\scripts\RunApp.groovy Compiling sources... [delete] Find duplicates of a file by content Please explain what is wrong with my proof by contradiction. Tue 03:42:38 | cache-2.a | 0.06 seconds | © 2007-2014 MarkLogic Corporation. Thanks and sorry for the distraction.

I really appreciate your answer on my problem eclipse grails grails-2.0 grails-plugin share|improve this question edited Dec 27 '13 at 20:10 tim_yates 100k11161200 asked Dec 27 '13 at 19:35 mrquad 73852774 Browse other questions tagged grails startup or ask your own question. Home | Browse | FAQ | Advertising | Blog | Feedback | MarkMail™ Legalese | About MarkLogic Server This worked great! –mrquad Dec 28 '13 at 8:48 It would be ideal if "grails clean" did that.

Looking for a term like "fundamentalism", but without a religious connotation Creating monthly files from an annual file Is there actually a cave entrance on every screen?