Home > Error Expected > Error Expected Init-declarator Before

Error Expected Init-declarator Before

Contents

Are backpack nets an effective deterrent when going to rougher parts of the world? I appreciate that. In this case, the problem is right at the top of your code. http://www.pdc.kth.se/doc/osf/osf40/HTML... http://invictanetworks.net/error-expected/error-expected-init-declarator-before-using.html

Hope this helps. 0 Discussion Starter hectic 8 Years Ago i do not find error in my code, what u are trying to tell is right, i have the same rule anyway got it all straigtened out. In my configuration.cpp, I would have: Code: #include "configuration.h" /* set all the defaults */ const int Configuration::Default.Position.x = 10; const int Configuration::Default.Position.y = 10; //... To me anyways.

Error Expected Init-declarator Before

How? Then, you must consider using the Singleton Design Pattern for the same. Forum New Posts FAQ Calendar Forum Actions Mark Forums Read Quick Links Today's Posts View Site Leaders What's New? Thanks.

  • But I keep getting the following errors for the lines in .cpp file where I initialize the default stuff.
  • Not thinking, and just doing copy and paste from my other parts of code is gonna be the end of me...
  • I can post the entire program on here if that helps.
  • I assume what you actually intended to do was call the function?
  • current community chat Stack Overflow Meta Stack Overflow your communities Sign up or log in to customize your list.
  • I have just started learning c++ and i have a lil' problem compiling one of my programs (ADT).
  • icepower3125 7 février 2008 à 14:41:39 je sais pas (ce code vient pas de moi) mais j'ai réussi à regler cette erreur en enlevant le bloc c et en mettant l'extention
  • What is the best way to learn Web development online?
  • Do you need a DefaultConfig?
  • g++ -g -c class12.h -o class12.o class12.h: In member function `void class2::class2Method()': class12.h:20: error: expected init-declarator before "Type3" class12.h:20: error: expected `,' or `;' before "Type3" make: *** [class12.o] Error 1

if so why? After all, if your compiler thinks it's helpful to tell you, don't you think it would be helpful to tell us? thanks. add a comment| 2 Answers 2 active oldest votes up vote 4 down vote accepted You need a typename typedef typename class1::Type1 Type3; Furthermore, you need to make the typedef in

Last edited on Jun 29, 2013 at 1:41pm UTC Jun 29, 2013 at 1:46pm UTC senhor (353) i marked line 6 as bold to show it is the line which compiler Whats wrong with this c program.error says"expected init-declarator before "main" "? Reply With Quote June 7th, 2005,09:58 AM #9 Latem View Profile View Forum Posts Member Join Date Feb 2004 Location Canada Posts 277 Re: error: expected init-declarator...? Can lead to ambiguities later on.

I dont know how to correct them. But there is a new error i didnt give me the line: [Linker error] undefined reference to `ticktacktoe(char (*) [3], std::string, int)' [Linker error] undefined reference to `ticktacktoe(char (*) [3], std::string, Errors in program P: n/a Daz01 Hi all. However, the configuration object should not be changed though, until the user presses the OK button.

I am a bit of a novice when it comes to formatting replies. As far as the design of it goes; maybe this isn't evidant from the code and info I supplied, but I am using singleton design Only one Configuration object is ever Error Expected Init-declarator Before Different functions. 2) One is declared as const while the other isn't. So i just wanted some quick and ez way to initialize the default part.

Last edited on Jun 29, 2013 at 2:05pm UTC Jun 29, 2013 at 2:12pm UTC senhor (353) thanks for help i compile the program it is not working fine but i get redirected here And then there is the Default struct, that has all the structs, again, and this is used to store the default configuration values. What does "init" mean at the end of sentences? Define a hammer in Pathfinder Is this the right way to multiply series?

You all get a point [EDIT]Micro you'll have to wait I guess, cuz appearantly i've been too generous, and given out too many points within the last 24 hrs. Thanks Nov 29 '06 #2 P: n/a Erik Wikstrm On 2006-11-29 14:49, Daz01 wrote: Hi all. Try using Clang instead of GCC, it usually has better error messages. http://invictanetworks.net/error-expected/error-expected-init-declarator-before-int.html Glad I was able to help :) Jun 29, 2013 at 1:49pm UTC senhor (353) there was missing semi colons at line 41 and 45 i correct them but it gives

sur ma machine ce code compile sans problème (avec les point-virgule bien sur). Source(s): http://www.tempest-sw.com/cpp/draft/ch04... Any helpappreciated.

share|improve this answer answered Jun 13 '13 at 10:57 Sebastian Redl 37.3k35581 thank you, what a stupid error!

Si c'est le cas, fait l'inverse et dis nous si ça change quelque chose icepower3125 7 février 2008 à 14:00:00 Non: voici main.cpp #include //pour les chaînes de caractères #include //pour Tenant claims they paid rent in cash and that it was stolen from a mailbox. this is c++ error Follow 2 answers 2 Report Abuse Are you sure you want to delete this answer? Please help! [code] /#include //Header … init-declarator before "float" 3 replies I'm getting this error from this code.

Video should be smaller than 600mb/5 minutes Photo should be smaller than 5mb Video should be smaller than 600mb/5 minutesPhoto should be smaller than 5mb Related Questions 21 D:\Untitled1.cpp expected init-declarator Is this illegal syntax? Ive written a program and there are 2 errors that appear when I try to compile the program. my review here There are many things that are not correct.

Jun 29, 2013 at 1:55pm UTC MikeyBoy (3514) Checker is the name of a function, declared at line 6. m_Type is not a class member the signature of the method is different. To start viewing messages, select the forum that you want to visit from the selection below. Encore un problème d'include?

I am to count all … Expected primary-expression issue 3 replies Hello, I'm having an issue with a line of code that really doesn't seem that it should be giving me Before posting, I've … please help with code >> expected primary-expression? 2 replies Im trying to make a console app to solve math in order to make things go faster.