Home > Error Expected > Error Expected Initializer Before Ool

Error Expected Initializer Before Ool


We recommend upgrading to the latest Safari, Google Chrome, or Firefox. Skip to content Ignore Learn more Please note that GitHub no longer supports old versions of Firefox. That worked ! I changed CMakeCache.txt to add CMAKE_CXX_FLAGS:STRING=-fPIC. click site

Here is what g++ complains about: g++ -c -Wall -pedantic clear_screen.cpp -lcurses -o .clear.o clear_screen.cpp:6:6: error: expected initializer before β€˜->’ token make: *** [.clear.o] Error 1 The corresponding makefile part looks quickNitin30th August 2006, 10:04there is no pro file in my code. Logged Nexus SFML Team Hero Member Posts: 6104 Thor Developer Re: [Solved] Problem compiling SFML 2.3.2 with MinGW32 « Reply #5 on: November 15, 2015, 04:55:15 pm » We should fix Before the program ends, at return 0;I would expect the CBox destructor to be called 3 times but it is being called 6 times?

Error Expected Initializer Before Ool

Logged Official FAQ: http://www.sfml-dev.org/faq.phpNightly Builds: http://www.nightlybuilds.ch/——————————————————————Dev Blog: http://dev.my-gate.net/Thor: http://www.bromeon.ch/libraries/thor/ Print Pages: [1] SFML community forums » Help » Window » [Solved] Problem compiling SFML 2.3.2 with MinGW32 DS-Natural designed by c++ compiler-errors g++ share|improve this question asked Jan 27 '13 at 1:16 yauser 321415 2 Is cur_term defined as a macro (#define) in the header files? Not the answer you're looking for?

  • Logged (most of the time I ignore long posts) Someone1 Multiple posting newcomer Posts: 11 Re: Code::Blocks has got some SERIOUS issues! « Reply #3 on: September 27, 2012,
  • So why such a long or indefinite amount of time?This whole example is probably contrived, and I am wondering whether exceptions is the right tool for this - it is similar
  • I mean it to repeat once but then it repeat more times than I expect.
  • despite having many instances of undeclared class names being used.This error is: Code: [Select] expected initializer before '.' token
    Now, I ask you, forum, what in the HECK is wrong here?
  • How do MinGW and MSYS CMake generators behave differently in this respect?
  • If i didn't put this semicolon it give the message va.cpp line 54: multiple types in one declaration i donot have reasoning for such behaviour.

Thank you for subscribing! Could clouds on aircraft wings produce lightning? About second issue of usr/local/Trolltech/Qt-4.1.2//include/QtGui/qmenubar.h:29: error: expected initializer before 'QtGuiModule' i changed my header file as #ifndef vA_H #define vA_H //QT4 includes #include //QGIS includes #include #include #include Error Expected Initializer Before 'int' ALL my instances of calling the class name, and using the member separator (".") are done CORRECTLY!The problem is (read my comment above), Code::Blocks now turns out to not save my

Why is it not saving my code properly? Error Expected Initializer Before β€˜ ’ Token Who owns genes? binary42 commented Aug 27, 2015 test.cc' || echo './'`src/logging_unittest.cc src/logging_unittest.cc:64:17: error: β€˜GFLAGS_NAMESPACE’ is not a namespace-name using namespace GFLAGS_NAMESPACE; ^ src/logging_unittest.cc:64:33: error: expected namespace-name before β€˜;’ token using namespace GFLAGS_NAMESPACE; ^ http://stackoverflow.com/questions/14543464/expected-initializer-before-token It did work.

All rights reserved. Error Expected Initializer Before 'void' I try it both with and without the line "using namespace std", but nothing worked.The error list: Symbol 'initializer_list' could not be resolvedI use Eclipse CDT and GCC 4.9.1. inherited from QgsMapTool part of output is g++ -DHAVE_CONFIG_H -I. -I. -I../../.. -g -O2 -DQT3_SUPPORT -I/usr/local/Trolltech/Qt-4.1.2//mkspecs/default -I/usr/local/Trolltech/Qt-4.1.2//include/Qt3Support -I/usr/local/Trolltech/Qt-4.1.2//include/QtCore -I/usr/local/Trolltech/Qt-4.1.2//include/QtDesigner -I/usr/local/Trolltech/Qt-4.1.2//include/QtGui -I/usr/local/Trolltech/Qt-4.1.2//include/QtNetwork -I/usr/local/Trolltech/Qt-4.1.2//include/QtOpenGL -I/usr/local/Trolltech/Qt-4.1.2//include/QtSql -I/usr/local/Trolltech/Qt-4.1.2//include/QtXml -I/usr/local/Trolltech/Qt-4.1.2//include -I/usr/local/Trolltech/Qt-4.1.2//include/QtSvg -I/usr/local/Trolltech/Qt-4.1.2//include/QtTest -I/usr/local/Trolltech/Qt-4.1.2//include/QtDesigner -D_REENTRANT -DQT_THREAD_SUPPORT -DNO_DEBUG more stack exchange communities company blog Stack Exchange Inbox Reputation and Badges sign up log in tour help Tour Start here for a quick overview of the site Help Center Detailed

Error Expected Initializer Before β€˜ ’ Token

CMAKE_MAKE_PROGRAM is not set. http://forum.arduino.cc/index.php?topic=277872.0 When I ACTUALLY make an error (Code::Blocks is reporting false errors) in the code, Code::Blocks returns NON-errors. Error Expected Initializer Before Ool Sign in to comment Contact GitHub API Training Shop Blog About © 2016 GitHub, Inc. Error Expected Initializer Before Numeric Constant I suppose I could try to write a wrapper function that returns a smart pointer reference to a valid object, but I would have to test the validity of it's return

Should I serve jury duty when I have no respect for the judge? get redirected here See g++ -E output to see what preprocessor does. Already have an account? The code is as follows:(This is an INCOMPLETE snippet of my code)Code: [Select]class game{
struct color{int r,g,b,n;};
struct screen_color{color c;};
bool collision (int X, int Error Expected Initializer Before β€˜using’

libtool: compile: g++ -DHAVE_CONFIG_H -I. -I./src -I./src -Wall -Wwrite-strings -Woverloaded-virtual -Wno-sign-compare -DNO_FRAME_POINTER -DNDEBUG -g -O2 -MT src/libglog_la-demangle.lo -MD -MP -MF src/.deps/libglog_la-demangle.Tpo -c src/demangle.cc -fPIC -DPIC -o src/.libs/libglog_la-demangle.o In file included from I mean, I don't have the mentioned issue now. Logged jens Administrator Lives here! http://invictanetworks.net/error-expected/error-expected-initializer-before-amespace.html You signed out in another tab or window.

float pond[n][n];int outputBMP("finaldata.bmp", (float*)pond, 499, 499);float pond[n][n];val=&pond[n][n];int outputBMP("finaldata.bmp", (float*)val, 499, 499); View 1 Replies View Related C++ :: Processing Structured Arrays - Too Many Initializer Values Apr 22, 2013 I working Error Expected Initializer Before Using C++ :: ATM - Expected Primary Expression Before Else C :: Expected Expression Before Token C++ :: Expected Primary Expression Before INT C++ :: Do While Loop - Expected Unqualified ID Terms Privacy Security Status Help You can't perform that action at this time.

Reload to refresh your session.

class (A) has a member function (fn) returns the value of (m) as it understands what (m) is.However, this gives different results compared with a non-template class in a similar scenario. The conditional compilation branch here only includes for MSVC, i.e. As far as the second error is concerned: va.cpp: In member function 'virtual void vA1::initGui()': va.cpp:98: error: no matching function for call to 'QAction::QAction(QIcon, const char [4], vA1* const)' /usr/local/Trolltech/Qt-4.1.2//include/QtGui/qaction.h:173: note: C++ Error Expected Initializer Before I don't think there's anything wrong with the library because other game I did compiles just file.

share|improve this answer answered Jul 29 '11 at 16:58 Mike Seymour 189k12255454 1 +1, but I'm guessing it's a global variable declaration, not a class declaration. The 3 numbers in a array are picked from 0 - 5. I LOVE YOU! my review here The error keeps telling me that there are too many initializer values.

My adviser wants to use my code for a spin-off, but I want to use it for my own company Translation of "help each other" Should I ever use the pronoun and I have gflags installed. I was for more than an hour looking for my error and finally you saved me. Logged Someone1 Multiple posting newcomer Posts: 11 Re: Code::Blocks has got some SERIOUS issues! « Reply #1 on: September 26, 2012, 11:53:21 pm » Okay, here's some more troubling news for

Doesnt emplace only create it and store it, then thats it?[URL] .....For pushback:void push_back(value_type&& _Val){// insert by moving into element at endif (_Inside(_STD addressof(_Val))){// push back an elementsize_type _Idx = _STD So technically, the lack of errors being displayed properly is not Code::Blocks' issue - it is the underlaying compiler?I will see to trying to get it fixed again. By LightsOut06 in forum C Programming Replies: 2 Last Post: 10-09-2005, 09:23 PM Dikumud By maxorator in forum C++ Programming Replies: 1 Last Post: 10-01-2005, 06:39 AM Please Help - Problem