Home > Error Failed > Error Failed To Author

Error Failed To Author

Contents

npm WARN [email protected] requires a peer of [email protected]>=0.9 but none was installed. If you would like to refer to this comment somewhere else in this project, copy and paste the following link: Jim - 2009-11-27 Hi, I too had encountered this very annoying Forum: Help Creator: kara corbeil Created: 2009-05-05 Updated: 2013-05-14 kara corbeil - 2009-05-05 This is the message I get when I click burn.   Authoring Failed Log: Failed to create DVD In this case you have to do an interactive git rebase for the affected commits. navigate to this website

npm v3.8.6 npm ERR! Failed at the [email protected] postinstall script 'node scripts/build.js'. [email protected] postinstall: `node scripts/build.js` npm ERR! Missing privileges to push commits of other users If pushing to Gerrit fails with the error message "invalid author" and somebody else is author of the commit for which the push https://review.cyanogenmod.org/Documentation/error-invalid-author.html

Error Failed To Author

Terms Privacy Security Status Help You can't perform that action at this time. In this case you have to do an interactive git rebase for the affected commits. Deepakdubey90 commented May 25, 2016 Great, It works for me .

  1. If only the last commit is affected you can do this by amending the last commit and explicitly setting the author: $ git commit --amend --author "John Doe " If you
  2. Could clouds on aircraft wings produce lightning?
  3. It was the main cause of failing author sessions.
  4. Exit status 1 npm ERR!
  5. We recommend upgrading to the latest Safari, Google Chrome, or Firefox.
  6. Why does the race hazard theorem work?

Making my building blocks modular What was the purpose of the soft hands in Ocean's Eleven? You signed in with another tab or window. package.json must be actual JSON, not just JavaScript. Author Is Not Name And Matches No Existing Author Uninstalling it wouldn't do anything if it's already disabled..

Error Log: Analytics Response [installModpack]: 200 Starting download of http://mirror.technicpack.net/Technic/version/1.2.5/1.2.5.json, with 3 tries remaining Starting download of http://resources.download.minecraft.net/ad/ad126e435cca94054bf0d616301799a105526cde, with 3 tries remaining Download of http://resources.download.minecraft.net/ad/ad126e435cca94054bf0d616301799a105526cde Failed! Log4j Error Failed To Flush Writer BigAndHard is an external firewire disk, so I moved the VIDEO_TS folder to the internal disk on my Mac. Make sure you confirm your e-mail address by clicking on the link in the e-mail verification mail sent by Gerrit. https://git.eclipse.org/r/Documentation/error-invalid-author.html npm ERR!

there's that... Intellij Git Author Make sure you have the latest version of node.js and npm installed. I tried Swinter's solution but it didnt work for me. make: *** [Release/obj.target/binding/binding.o] Error 1 gyp ERR!

Log4j Error Failed To Flush Writer

stack at Process.ChildProcess._handle.onexit (internal/child_process.js:204:12) gyp ERR! https://wordpress.org/support/topic/error-failed-to-find-translation-project/ This is confusing for users who try to specify a valid complete author name. Error Failed To Author Browse other questions tagged git git-commit git-config git-commands or ask your own question. Error:--author Is Not 'name ' And Matches No Existing Author npm WARN [email protected] No license field.

v8::String::ExternalAsciiStringResource *resource) { ~~~~~~~~~~~~^~~~~~~~~~~~~~~~~~~~~~~~~~~ ExternalStringResource /Users/zul/.node-gyp/6.4.0/include/node/v8.h:2230:19: note: 'ExternalStringResource' declared here class V8_EXPORT ExternalStringResource ^ In file included from ../binding.cpp:1: ../../nan/nan.h:480:36: error: redefinition of 'NanNew' NAN_INLINE v8::Local NanNew( ^ ../../nan/nan.h:475:36: note: previous http://invictanetworks.net/error-failed/error-failed.html You can get information on how to open an issue for this project with: npm ERR! npm ERR! npm owner ls node-sass npm ERR! Fatal: No Existing Author Found With

You signed out in another tab or window. It will use the first found commit's user as the author. Rename the error message to make it clearer that the failure has two reasons in this case. my review here You'll have to configure each text domain you want to translate.

trisquel87 referenced this issue Jun 7, 2016 Closed ERROR : Failed at the [email protected] postinstall script 'node scripts/build.js'. #1540 mimikn commented Jun 10, 2016 • edited I also am unable to Git Config Author That was it. Windows_NT 6.1.7601 npm ERR!

Worked for me.

Sign in to comment Contact GitHub API Training Shop Blog About © 2016 GitHub, Inc. bramdevries commented Dec 19, 2015 You need to remove the , on the last line of your dependencies ("grunt-contrib-watch": "~0.4.3",) JSON doesn't allow trailing commas 👍 2 ismael-rivera commented Dec I guess your "node" and "nodejs" are two different beasts. Git Commit Author Example You signed out in another tab or window.

npm owner ls node-sass npm ERR! node v6.1.0 npm ERR! Thanks for your quick help. get redirected here Note Internal Comment Reference Category Reference Attribute This translation is not an official version and has been provided for convenience only, using SDL Language Cloud.

npm ERR! Find the pre-release here (to make sure it works): http://dl.dropbox.com/u/4188583/burn29pre-build3.zip If you would like to refer to this comment somewhere else in this project, copy and paste the following link: Adam npm WARN [email protected] No description npm WARN [email protected] No repository field. argv "/root/.nvm/versions/node/v6.1.0/bin/node" "/root/.nvm/versions/node/v6.1.0/bin/npm" "i" npm ERR!

There is likely additional logging output above. Try downloading one pack from the Platform, after that fails post the error log. If you would like to refer to this comment somewhere else in this project, copy and paste the following link: Paul - 2009-10-17 I have the same problem. Personal Open source Business Explore Sign up Sign in Pricing Blog Support Search GitHub This repository Watch 422 Star 5,794 Fork 1,425 libgit2/libgit2 Code Issues 126 Pull requests 52 Projects

npm bugs node-sass npm ERR! Am I doing something wrong? Share this post Link to post Share on other sites Munaus 275 Captain Obvious Moderators 275 4926 posts IGN: munaus_7 Posted 29 Jan 2014 Paying antivirus is silly when you not ok code 0 Here is my log: 0 info it worked if it ends with ok 1 verbose cli [ '/usr/local/Cellar/node/0.10.26/bin/node', 1 verbose cli '/usr/local/bin/npm', 1 verbose cli 'install' ]

This will tell me why it blocks the launcher Share this post Link to post Share on other sites foxhead4 0 Member Members 0 8 posts Posted 31 Jan 2014 asked 2 years ago viewed 16380 times active 3 months ago Get the weekly newsletter! npm bugs node-sass npm ERR! npm bugs node-sass npm ERR!

Share this post Link to post Share on other sites 10 answers to this question Sort by rating Sort by date Munaus 275 Captain Obvious Moderators 275 4926 posts IGN: node v4.4.2 npm ERR! not with npm itself. You have a newline in your email!