Home > Error Failed > Error Failed To Execute Adclone.pl

Error Failed To Execute Adclone.pl

Contents

Running perl /u01/oracle/R122/fs1/EBSapps/appl/ad/12.0.0/patch/115/bin/adProvisionEBS.pl ebs-get-serverstatus -contextfile=/u01/oracle/R122/fs1/inst/apps/TEST_rel-dem-test01/appl/admin/TEST_rel-dem-test01.xml -servername=AdminServer -promptmsg=hide The Oracle WebLogic Administration Server is up. May 7, 2014 Oracle CPU patches for April-2014released April 16, 2014 Deploy Application war file on Weblogic Managed Server using pythonscript April 14, 2014 Install Weblogic in Silent mode using silent.xml Running perl /d01/oracle/R122/fs1/EBSapps/appl/ad/12.0.0/patch/115/bin/adProvisionEBS.pl ebs-get-serverstatus -contextfile=/d01/oracle/R122/fs1/inst/apps/PROD_idbaprod-appl/appl/admin/PROD_idbaprod-appl.xml -servername=AdminServer -promptmsg=hide The Oracle WebLogic Administration Server is up. Do the following in : $AD_TOP/admin/template/adlnkoh.sh CHANGE make -f ins_srvm.mk iodbagrp >> $LOGF 2>&1 TO make -f ins_srvm.mk iosdbagrp >> $LOGF 2>&1 3. http://invictanetworks.net/error-failed/error-failed-execute-bin31-armcc.html

Please type your message and try again. Solution: unset the environment variable "LDR_CNTRL" and re run adcfgclone.pl appTier. Target System Hostname (virtual or normal) [rel-dem-test01] : Target System Database SID : TEST Target System Database Server Node [rel-dem-prodas01] : rel-dem-testdb01 Target System Database Domain Name [ora.ad] : Target System Apps DBA Workshop My Experiences with Oracle Technologies .....

Error Failed To Execute Adclone.pl

Here in the above picture, if run filesystem is on fs2 […] R12.2 Autoconfig failing with ORA-06512: at "APPS.ADX_PRF_PKG", line 83 Hi, In the proces of upgrading from R12.1.3 to R12.2.4. Entries (RSS) and Comments (RSS). The new database context file has been created : */u03/UAT/uatdb/10.2.0/appsutil/UAT_msftora2.xml* Log file located at /tmp/CloneContext_10081143.log Running Rapid Clone with command: perl /u03/UAT/uatdb/10.2.0/appsutil/clone/bin/adclone.pl java=/u03/UAT/u atdb/10.2.0/appsutil/clone/bin/../jre mode=apply stage=/u03/UAT/uatdb/10.2.0/app sutil/clone/bin/.. Re: Error while runnig adcfgclone.pl dbTier EBSDBA Oct 13, 2011 6:28 AM (in response to 884225) Hi, Exception occurred: java.sql.SQLException: ORA-01017: invalid username/password; logon deniedAre you able to connect to the

Start the application Tier using adstral.sh This time set the env to RUN File System . /u01/oracle/R122/EBSapps.env run cd $ADMIN_SCRIPTS_HOME adstral.sh apps/apps Hope so this Helps………………… Posted October 23, 2013 by error when executing perl adcfgclone.pl dbTier Shann asked Oct 14, 2008 | Replies (1) Anybody please help.. ERROR: Failed to execute /apps/fs1/EBSapps/comn/clone/bin/adclone.pl Please check logfile.Do you have any suggestion? Service "TEST" has 1 instance(s).

tnsnames.ora file on Node A will have an FNDSM entry for that node only, as the application has no information for Node B yet. 2. Welcome Guest ( Log In | Register ) Oracle DBA Forums>Oracle>Oracle Forum ERROR : Failed Re: Error while runnig adcfgclone.pl dbTier Felix Oct 11, 2011 7:22 PM (in response to 884225) Check the value for s_db_listener in the context file on the DB node. have a peek at these guys With the introduction of dualfs in R12.2.5 we can even configure patch filesystem with single run of adcfgclone on the target node.

return code = .16.17.18.21.22.23.24.25.32.33.34.36.37.38 Please check logfile located at /oratest/R12_app/inst/apps/test_testerp/logs/ora/10.1.2/install/make_02021115.log .end std out. when clonning dbTier Cloning Error Autoconfig Exiting with Status 1 on Appstier adcfgclone error AutoConfig Error Report ld.so.1: pmcmd: fatal: libpmasrt.so: Open Failed: No Such File Or Directory White Papers & The report format is:             [APPLY PHASE]   AutoConfig could not successfully execute the following scripts:     Directory: /clone/oracle/product/11.2.0/perl/bin/perl -I /clone/oracle/product/11.2.0/perl/lib/5.8.3 -I /clone/oracle/product/11.2.0/perl/lib/site_perl/5.8.3 -I Like Show 0 Likes(0) Actions 12.

  1. No spaces please The Profile Name is already in use Password Notify me of new activity in this group: Real Time Daily Never Keep me informed of the latest: White Papers
  2. Your listener looks OK., Did you find any erros in database alert log file Thanks Like Show 0 Likes(0) Actions 1 2 Previous Next Go to original post Actions About Oracle
  3. Start the application Tier using adstral.sh ------------------------------------------------------- RUN the ENV for the Applciation tier cd $ADMIN_SCRIPTS_HOME adstral.sh apps/apps Provide Weblogic Password: Once application is up do a sample Health Check.
  4. Errors are grouped by directory and phase.The report format is: [PROFILE PHASE] AutoConfig could not successfully execute the following scripts: Directory: /u02/inst/apps/DEV_blu/admin/install afcpctx.sh INSTE8_PRF 1AutoConfig
  5. December 11, 2013 How to Find OCR Master Node inRAC December 10, 2013 Oracle RAC 11gR2 OCR manual Bakup and adding OCR Mirrordevice December 10, 2013 RAC-Enable Archive Log-Configure to ASMLocation
  6. John Messam replied Dec 5, 2008 Did you get this resolved.

OracleAPPSDBA & Oracle DBA Blog OracleAppsDBA-11i/R12/R12.2 OracleDBA-10/11g OracleDBA-12c OracleAPPSDBA-11i/R12 OracleAPPSDBA-R12.2 OracleRAC Linux RSS Feed Archive for the ‘Cloning' Category R12.2.5 single nodecloning 1 comment Hello all, After long time http://oracle.ittoolbox.com/groups/technical-functional/oracle-apps-l/error-when-executing-perl-adcfgclonepl-dbtier-2405307 Powered by Blogger. Error Failed To Execute Adclone.pl Skip navigationOracle Community DirectoryOracle Community FAQLog inRegisterMy Oracle Support Community (MOSC)SearchSearchCancelGo Directly To Oracle Technology Network CommunityMy Oracle Support CommunityOPN Cloud ConnectionOracle Employee CommunityOracle User Group CommunityTopliners CommunityOTN Speaker BureauJava CommunityError: Newer Post Older Post Home Subscribe to: Post Comments (Atom) Blog Archive ► 2016 (2) ► March (2) ► 2015 (1) ► June (1) ► 2014 (7) ► December (1) ►

Here in the above picture, if run filesystem is on fs2 on the source then on the target also we should configure fs2 as run filesystem and automatically fs1 will become useful reference Total System Global Area 1073741824 bytes Fixed Size 1271540 bytes Variable Size 427821324 bytes Database Buffers 633339904 bytes Redo Buffers 11309056 bytes Database mounted. Compilation failed in require at /clone/oracle/product/11.2.0/appsutil/clone/ouicli.pl line 35. Please type your message and try again.

Adcfgclone.pl dbTier Failed: RC-00110 ORA-19909: Datafile 1 belongs to an orphan incarna... ERROR: Failed to execute /u03/TEST/testdb/10.2.0/appsutil/clone/bin/adclone.pl But when i connect to the database it is working SQL> select open_mode from v$database; OPEN_MODE ---------- READ WRITE and SQL> select name from v$database; NAME Re: Error while runnig adcfgclone.pl dbTier 884225 Oct 11, 2011 4:06 PM (in response to Hussein Sawwan-Oracle) I copied the files again and run the perl adcfgclone.pl dbTier Im getting the my review here It should solve the Issue.

getConnectionUsingSID() --> JDBC URL: jdbc:oracle:thin:@msftora2.msftpnq.com:1528:UAT Exception occurred: java.sql.SQLException: ORA-01017: invalid username/password; logon denied Trying to connect using SID as ServiceName getConnectionUsingServiceName() --> JDBC URL: jdbc:oracle:thin:@(DESCRIPTION=(ADDRESS=(PROTOCOL=tcp)(HOST=msftora2.msftpnq.com)(PORT=1528))(CONNECT_DATA=(SERVICE_NAME=UAT))) Exception occurred: java.sql.SQLException: ORA-01017: invalid username/password; STEP2: Manually copy the three .txt files from the 3636980\izu\admin directory to your own temporary directory. Posted October 5, 2013 by balaoracledba.com in Cloning, Issues RC-20200: Fatal: Could not find Unzip.

Enter password: Connected to an idle instance.

Start a new thread here 2405307 Related Discussions Reg:adcfgclone.pl appstier error in recloning Error: can't find libjava.so. The owner of blog will not be liable for any errors or omissions in this information nor for the availability of this information. If that is pointing to the source database then correct it and rerun adcfgclone.pl on the DB node. Re: Error while runnig adcfgclone.pl dbTier Hussein Sawwan-Oracle Oct 8, 2011 8:06 PM (in response to 884225) this is the error im getting wen im trying to connect to DBSQL> alter

export PERL5LIB=/usr/local/lib64/perl5:/usr/local/share/perl5:/usr/lib64/perl5/vendor_perl:/usr/share/perl5/vendor_perl:/usr/lib64/perl5:/usr/share/perl5:.:/dbac/oracle/product/11.2.0.4/appsutil/perl:/dba1c/oracle/product/11.2.0.4/appsutil/perl Re-run adcfgclone script again. Can you connect to the database and query the tables? Restored the Context file in : /oratest/R12_app/inst/apps/test_testerp/appl/admin/test_testerp.xml Aborting the running of Context Value Management Error occured before Context Value Management could be completed - 73% completed ERROR while running Apply... get redirected here ERROR: Failed to execute $RDBMS_ORACLE_HOME/appsutil/clone/bin/adclone.pl-- Found the following in Cloning log file: dest : $ORACLE_HOME/oui/bin/runInstaller.sh backup : $ORACLE_HOME/oui/bin/runInstaller.sh to $ORACLE_HOME/appsutil//out/$SID_$HOSTNAME/runInstaller.sh DEBUG : The destination file does not have write permission $ORACLE_HOME/oui/bin/runInstaller.sh

When cloning the file adlnkoh.sh will be instantiated, so modifying /appsutil/install/adlnkoh.sh will get overwritten when running adcfgclone reflected from the workaround below. Target System Fusion Middleware Home set to /u01/oracle/R122/fs2/FMW_Home Target System Web Oracle Home set to /u01/oracle/R122/fs2/FMW_Home/webtier Target System Appl TOP set to /u01/oracle/R122/fs2/EBSapps/appl Target System COMMON TOP set to /u01/oracle/R122/fs2/EBSapps/comn Target